Localizzazione di archivio
type: NamedIndividual
type: Tipo di localizzazione
label: Archival location @en
comment: Questo individuo rappresenta uno specifico tipo di localizzazione, ovvero la localizzazione di archivio.
comment: This individual represents a specific type of location, that is the archival location. @en
version info: stabile
version info: stable @en
iccd norm tag: ICCD Normativa BDM versioni precedenti alla 4.00: se TCL = 'di archivio'

Foglio di mappa catastale
type: Class
label: Cadastral map folio @en
comment: Questa classe rappresenta un foglio di mappa catastale, in cui ricadono una o più particelle.
comment: This class represents a folio of a cadastral map, which contains one or more cadastral parcels. @en
subclass of: Entità catastale
subclass of: Restriction
  all values from: Literal
  on property: time
version info: stabile
version info: stable @en
iccd norm tag: ICCD Normativa Trasversale 4.00: CS/CTS/CTSF ; LS/CSS/CSSF. - Normativa RA v.2: RP/LGC/LGCM+LGCA

Collezione di particelle catastali
type: Class
label: Cadastral unit collection @en
comment: Questa classe rappresenta una o più particelle catastali.
comment: This class represents one or more cadastral parcels. @en
subclass of: Entità catastale
subclass of: Restriction
  all values from: LegalSituation
  on property: hasLegalSituation
version info: stabile
version info: stable @en
iccd norm tag: ICCD Normativa Traversale 4.00: CS/CTS/CTSN; LS/CSS/CSSN. - Normativa RA v.2: RP/LGC/LGCR

Capoluogo
type: NamedIndividual
type: Tipo di carattere amministrativo del centro storico
label: Chief town @en
comment: Questo individuo rappresenta uno specifico tipo di riferimento amministrativo che caratterizza un centro storico, ovvero il capoluogo.
comment: This individual represents a specific type of administrative reference that characterizes an old town, that is the chief town. @en
version info: stabile
version info: stable @en
iccd norm tag: ICCD Normative A e PG: LC/CST/CSTA.

Luogo di raccolta
type: NamedIndividual
type: Tipo di localizzazione
label: Collecting location @en
version info: instabile
version info: unstable @en

Localizzazione fisica attuale
type: NamedIndividual
type: Tipo di localizzazione
label: Current Physical Location @en
comment: Questo individuo rappresenta uno specifico tipo di localizzazione, ovvero la localizzazione fisica attuale.
comment: This individual represents a specific type of localization, that is the current physical location. @en
version info: stabile
version info: stable @en

Luogo di esposizione
type: NamedIndividual
type: Tipo di localizzazione
label: Exhibition Location @en
comment: Questo individuo rappresenta uno specifico tipo di localizzazione, ovvero il luogo di esposizione.
comment: This individual represents a specific type of localization, that is the exhibition location. @en
version info: stabile
version info: stable @en

Contesto extraurbano
type: NamedIndividual
type: Tipo di contesto geografico
label: Extra-urban context @en
comment: Questo individuo rappresenta uno specifico tipo di contesto, ovvero il contesto extraurbano dove si trova il bene culturale.
comment: This individual represents a specific type of context, that is the extra-urban context where the cultural property is located. @en
version info: stabile
version info: ustable @en
iccd norm tag: ICCD Normative A e PG: LC/SET/SETT (sigla TP)

Luogo di reperimento
type: NamedIndividual
type: Tipo di localizzazione
label: Finding Location @en
comment: Questo individuo rappresenta uno specifico tipo di localizzazione, ovvero il luogo di ritrovamento.
comment: This individual represents a specific type of localization, that is the finding location. @en
version info: stabile
version info: stable @en

Localizzazione storica
type: NamedIndividual
type: Tipo di localizzazione
label: Historical Location @en
comment: Questo individuo rappresenta uno specifico tipo di localizzazione, ovvero la localizzazione storica.
comment: This individual represents a specific type of localization, that is the historical location. @en
version info: stabile
version info: stable @en

Centro inglobato
type: NamedIndividual
type: Tipo di carattere amministrativo del centro storico
label: Incorporated area @en
comment: Questo individuo rappresenta uno specifico tipo di riferimento amministrativo che caratterizza un centro storico, ovvero la denominazione di 'centro inglobato'.
comment: This individual represents a specific type of administrative reference that characterizes the old town, that is the denomination of 'incorporated area'. @en
version info: stabile
version info: stable @en
iccd norm tag: ICCD Normative A e PG: LC/CST/CSTA

Luogo di provenienza / Collocazione precedente
type: NamedIndividual
type: Tipo di localizzazione
label: Place of Origin / Last Location @en
comment: Questo individuo rappresenta uno specifico tipo di localizzazione, ovvero il luogo di provenienza o collocazione precedente.
comment: Replaced by https://w3id.org/arco/ontology/location/PreviousLocation @en
comment: This individual represents a specific type of location, that is the place of origin or last location. @en
deprecated: true
version info: stabile
version info: stable @en

Località
type: NamedIndividual
type: Tipo di carattere amministrativo del centro storico
label: Locality @en
comment: Questo individuo rappresenta uno specifico tipo di riferimento amministrativo che caratterizza il centro storico, ovvero la località.
comment: This individual represents a specific type of administrative reference that characterizes the old town, that is the locality. @en
version info: stabile
version info: stable @en
iccd norm tag: ICCD Normative A e PG: LC/CST/CSTA.

Elemento di confine
type: Class
label: Neighbouring cadastral entity @en
comment: Questa classe rappresenta le entità spaziali (particelle, strade, corsi d'acqua, ecc.) confinanti con una o più particelle catastali.
comment: This class represents spatial entities (i.e. roads, waterways, etc.) that border one or more cadastral parcels. @en
subclass of: Entità catastale
version info: stabile
version info: stable @en
iccd norm tag: ICCD Normativa Trasversale 4.00: CS/CTE. - CS/CTS/CTSE. - LC/CSS/CSSE

Luogo di rilevamento
type: NamedIndividual
type: Tipo di localizzazione
label: Observation Location @en
comment: Questo individuo rappresenta uno specifico tipo di localizzazione, ovvero il luogo di rilevamento.
comment: This individual represents a specific type of location, that is the location of observation. @en
version info: stabile
version info: stable @en

Luogo di provenienza / Collocazione precedente
type: NamedIndividual
type: Tipo di localizzazione
label: Place of Origin / Previous Location @en
comment: Questo individuo rappresenta uno specifico tipo di localizzazione, ovvero il luogo di provenienza o collocazione precedente.
comment: This individual represents a specific type of location, that is the place of origin or previous location. @en
version info: stabile
version info: stable @en

Luogo di produzione / realizzazione
type: NamedIndividual
type: Tipo di localizzazione
label: Production or Realization Location @en
comment: Questo individuo rappresenta un tipo specifico di posizione, ovvero il luogo di produzione o realizzazione.
comment: This individual represents a specific type of location, that is the production or realization location. @en
version info: stabile
version info: stable @en

Luogo della ripresa
type: NamedIndividual
type: Tipo di localizzazione
label: Shooting Location @en
comment: Questo individuo rappresenta un tipo specifico di posizione, ovvero il luogo della ripresa.
comment: This individual represents a specific type of localization, that is the shooting location. @en
version info: stabile
version info: stable @en

Luogo di deposito
type: NamedIndividual
type: Tipo di localizzazione
label: Storage Location @en
comment: Questo individuo rappresenta un tipo specifico di localizzazione, ovvero il luogo di deposito.
comment: This individual represents a specific type of localization, that is the storage location. @en
version info: stabile
version info: stable @en

Area rappresentata
type: NamedIndividual
type: Tipo di localizzazione
label: Subject Location @en
comment: Questo individuo rappresenta un tipo specifico di localizzazione, ovvero l'area rappresentata.
comment: This individual represents a specific type of localization, that is the subject location. @en
version info: stabile
version info: stable @en

Contesto suburbano
type: NamedIndividual
type: Tipo di contesto geografico
label: Suburban context @en
comment: Questo individuo rappresenta uno specifico tipo di contesto geografico, ovvero un contesto suburbano che si trova nella zona intermedia tra il contesto urbano e quello extraurbano.
comment: This individual represents a specific type of geographical context, that is a suburban context, which is located in the intermediate area between the urban and extraurban context. @en
version info: stabile
version info: stable @en
iccd norm tag: ICCD Normativa Trasversale: LC/PVZ; LA/PRZ - Normative A e PG: LC/SET/SETT (sigla SU anomalo)

Contesto territoriale
type: NamedIndividual
type: Tipo di contesto geografico
label: Territorial context @en
comment: Questo individuo rappresenta uno specifico tipo di contesto, ovvero il contesto territoriale in cui si trova il bene culturale.
comment: This individual represents a specific type of context, i.e. the territorial context where the cultural property is located. @en
version info: stabile
version info: stable @en
iccd norm tag: ICCD Normativa Trasversale: LC/PVZ; LA/PRZ

Frazione del centro urbano
type: NamedIndividual
type: Tipo di carattere amministrativo del centro storico
label: Town fraction @en
comment: Questo individuo rappresenta uno specifico tipo di riferimento amministrativo che caratterizza centro storico, ovvero la frazione cittadina.
comment: This individual represents a specific type of administrative reference that characterizes the old town, i.e. the town fraction. @en
version info: stabile
version info: stable @en
iccd norm tag: ICCD Normative A e PG: LC/CST/CSTA

Contesto subacqueo
type: NamedIndividual
type: Tipo di contesto geografico
label: Underwater context @en
comment: Questo individuo rappresenta un particolare tipo di contesto, ovvero il contesto subacqueo nel quale si trova il bene culturale.
comment: This individual represents a specific type of context, that is the underwater context where the cultural property is located. @en
version info: stabile
version info: stable @en
iccd norm tag: ICCD Normativa Trasversale: LC/PVZ; LA/PRZ

Contesto urbano
type: NamedIndividual
type: Tipo di contesto geografico
label: Urban context @en
comment: Questo individuo rappresenta uno specifico tipo di contesto, ovvero il contesto urbano nel quale si trova il bene culturale.
comment: This individual represents a specific type of context, that is the urban context where the cultural asset is located. @en
version info: stabile
version info: stable @en
iccd norm tag: ICCD Normativa Trasversale: LC/PVZ; LA/PRZ - Normative A e PG: LC/SET/SETT (sigla SU)

Numero d'ordine amministrativo
type: DatatypeProperty
label: Administrative order number @en
comment: Questa proprietà associa il numero d'ordine che identifica una località intesa come unità amministrativa, ovvero un centro storico, una zona urbana e un settore.
comment: This property associates the order number that identifies a location intended as an administrative unit, i.e. an old town, an urban area and a sector. @en
domain: AdministrativeUnitComponent
range: Literal
sub property of: identifier
version info: stabile
version info: stable @en
iccd norm tag: ICCD Normative A e PG: LC/CST/CSTN; LC/ZUR/ZURN; LC/SET/SETN

denominazione del catasto
type: DatatypeProperty
type: FunctionalProperty
label: cadastre name @en
comment: Questa proprietà rappresenta la denominazione con cui è noto un catasto storico.
comment: This property represents the designation of a historical cadastre. @en
domain: Identità catastale
range: Literal
sub property of: name
version info: stabile
version info: stable @en
iccd norm tag: ICCD Normativa Trasversale 4.00: LS/CSS/CSSD

identificativo del contenitore giuridico
type: DatatypeProperty
type: FunctionalProperty
label: cultural institute or site identifier @en
comment: Questa proprietà permette di associare un contenitore giuridico al codice assegnatogli dall'ICCD.
comment: This property allows to associate a legal container to its code assigned by the ICCD. @en
domain: CulturalInstituteOrSite
range: Literal
sub property of: identifier
version info: stabile
version info: stable @en
iccd norm tag: ICCD Normativa Trasversale: LC/LDC/LDCG; LA/PRC/PRCG

Numero del settore
type: DatatypeProperty
label: District number @en
comment: Questa proprietà rappresenta il numero progressivo che individua il settore dove si trova il bene culturale.
comment: This property represents the progressive number that identifies the district where the cultural property is located. @en
domain: District
range: Literal
sub property of: identifier
version info: stabile
version info: stable @en
iccd norm tag: ICCD Normative A e PG: LC/SET/SETP

ha base cartografica
type: ObjectProperty
label: has base map @en
comment: Questa proprietà collega una georeferenziazione di un oggetto alla base cartografica eventualmente utilizzata.
comment: This property links an object georeferencing to the base map possibly used. @en
domain: Geometry
range: Base cartografica
inverse of: è base cartografica di
version info: stabile
version info: stable @en
iccd norm tag: ICCD Normativa Trasversale 4.00: GE/GPB; versioni precedenti: GP/GPB - GA/GAB - GL/GLB

ha identità catastale
type: ObjectProperty
label: has cadastral identity @en
comment: Questa proprietà collega un bene culturale all'insieme delle informazioni catastali che lo riguardano, relativamente a una delle sue localizzazioni (storica, attuale, di rinvenimento, ecc.)
comment: This property links a cultural property to all its cadastral information related to one of its locations: i.e. historical location, current location, finding location, etc. @en
domain: CulturalEntity
range: Identità catastale
inverse of: è identitià catastale di
version info: stabile
version info: stable @en
iccd norm tag: ICCD Normativa Trasversale 4.00: CS. - Normativa RA v.2: RP/LGC

ha area amministrativa ecclesiastica
type: ObjectProperty
label: has clerical administrative area @en
comment: Questa proprietà collega un indirizzo a un'area amministrativa ecclesiastica (ad es. una diocesi).
comment: This property relates an address to a clerical administrative area (e.g. a diocese). @en
domain: Address
range: ClericalAdministrativeArea
sub property of: hasAddressComponent
inverse of: è area amministrativa ecclesiastica di
version info: stabile
version info: stable @en
iccd norm tag: ICCD Normativa Trasversale 4.00: LC/PVE; LA/PRE

ha continente
type: ObjectProperty
label: has continent @en
comment: Questa proprietà collega la localizzazione di un'entità al continente in cui si trova.
comment: This property links the location of an entity to the continent where it is located. @en
domain: Thing
range: Continente
inverse of: è continente di
version info: stabile
version info: stable @en
iccd norm tag: ICCD Normativa Trasversale: LA/PRT/PRTK

ha luogo o istituto della cultura
type: ObjectProperty
label: has cultural institute or site @en
comment: Questa proprietà collega un bene culturale al luogo o istituto della cultura (contenitore giuridico) in cui è contenuta
comment: This property links a cultural property to the cultural institute or site @en
domain: Thing
range: CulturalInstituteOrSite
inverse of: è luogo o istituto della cultura di
version info: instabile
version info: unstable @en

ha definizione del contenitore giuridico
type: ObjectProperty
label: has cultiral institute or site definition @en
comment: Questa proprietà collega la tipologia di un contenitore giuridico a una delle sue componenti, cioè alla definizione della sua tipologia.
comment: This property links the type of a cultural institute or site to one of its components, that is to the definition of its type. @en
domain: Tipo di Contenitore Giuridico
range: Definizione di Contenitore Giuridico
inverse of: è definizione del contenitore giuridico di
version info: instabile
version info: unstable @en
iccd norm tag: ICCD Normativa CG: CG/CGT

ha qualificazione del contenitore giuridico
type: ObjectProperty
label: has cultural institute or site specification @en
comment: Questa proprietà collega la tipologia di un contenitore giuridico a una delle sue componenti, cioè alle specifiche sulla sua tipologia.
comment: This property links the type of a cultural institute or site to one of its components, that is to the specifications of its type. @en
domain: Tipo di Contenitore Giuridico
range: Specificazione di Contenitore Giuridico
inverse of: è specificazione di contenitore giuridico
version info: instabile
version info: unstable @en
iccd norm tag: ICCD Normativa CG: CG/CGQ

ha tipo di contenitore giuridico
type: ObjectProperty
label: has cultural institute or site type @en
comment: Questa proprietà collega un contenitore giuridico al tipo di contenitore giuridico, per permetterne la corretta e precisa individuazione.
comment: This property connects a Cultural institute or site to its type, to allow its correct and precise identification. @en
domain: CulturalInstituteOrSite
range: Tipo di Contenitore Giuridico
sub property of: hasType
inverse of: è tipo di contenitore giuridico di
version info: instabile
version info: unstable @en
iccd norm tag: ICCD Normativa CG: CG/CGT; CG/CGQ

indirizzo del bene culturale
type: ObjectProperty
label: cultural property address @en
comment: Questa proprietà rappresenta la relazione che collega un bene culturale all'indirizzo della sua localizzazione fisica attuale, al momento della catalogazione. La relazione fornisce una rappresentazione semplificata, con ridotta espressività, della localizzazione attuale del bene culturale, e provoca la perdita delle altre informazioni che riguardano la collocazione del bene (continente, eventuale contenitore fisico, collocazione specifica nel contenitore fisico, ecc.).
comment: This property represents the relationship that links a cultural property to the address of its current physical location at the cataloging time. The report provides a simplified representation, with a reduced expressivity, of the current location of the cultural property, and it causes the loss of other information regarding its location (i.e. the continent, the possible physical container, the specific location in the physical container, etc.). @en
domain: CulturalEntity
range: Address
inverse of: è indirizzo del bene culturale
property chain axiom: ha localizzazione tipizzata nel tempo
property chain axiom: presso luogo
property chain axiom: hasAddress
property chain axiom: presso contenitore fisico
version info: stabile
version info: stable @en
iccd norm tag: ICCD Normativa Trasversale 4.00: LC/PVC

ha metodo di georeferenziazione
type: ObjectProperty
label: has geometry method @en
comment: Questa proprietà collega una georeferenziazione al metodo utilizzato per il posizionamento.
comment: This property links a georeferencing to the method used for the object positioning. @en
domain: Geometry
range: Metodo di posizionamento
inverse of: è metodo di georeferenziazione di
version info: stabile
version info: stable @en
iccd norm tag: ICCD Normativa Trasversale 4.00: GE/GPM; versioni precedenti: GP/GPM - GA/GAM - GL/GLM

ha tecnica di georeferenziazione
type: ObjectProperty
label: has geometry technique @en
comment: Questa proprietà collega una georeferenziazione alla tecnica di georeferenziazione.
comment: This property links a georeferencing to the georeferencing technique. @en
domain: Geometry
range: Tecnica di georeferenziazione
inverse of: è tecnica di georeferenziazione di
version info: stabile
version info: stable @en
iccd norm tag: ICCD Normativa Trasversale 4.00: GE/GPT; versioni precedenti: GP/GPT - GA/GAT - GL/GLT

ha area di appartenenza amministrativa
type: ObjectProperty
label: has governamental administrative area @en
comment: Questa proprietà collega un indirizzo a un'area di appartenenza amministrativa.
comment: This property links an address to a governmental administrative area. @en
domain: Address
range: GovernamentalAdministrativeArea
sub property of: hasAddressComponent
inverse of: è area di appartenenza amministrativa di
version info: stabile
version info: stable @en
iccd norm tag: ICCD Normativa Trasversale 4.00: LS/LCS/LCSA; LA/PRT/PRTR

ha area storica
type: ObjectProperty
label: has historical area @en
comment: Questa proprietà collega un indirizzo a un'area storico-geografica.
comment: This property links an address to a historical-geographical area. @en
domain: Address
range: AdministrativeUnitComponent
sub property of: hasAddressComponent
inverse of: è area storica di
version info: stabile
version info: stable @en

ha tipo di contenitore fisico
type: ObjectProperty
label: has site type @en
comment: Questa proprietà collega un contenitore fisico al tipo di contenitore fisico, per permetterne la corretta e precisa individuazione.
comment: This property connects a physical container (Site) to its type, to allow its correct and precise identification. @en
domain: Site
range: Tipo di Contenitore Fisico
sub property of: hasType
inverse of: è tipo di contenitore fisico di
version info: stabile
version info: stable @en
iccd norm tag: ICCD Normativa Trasversale: LC/LDC/LDCT; LC/LDC/LDCQ

ha ambiente
type: ObjectProperty
label: has stratigraphic area @en
comment: Questa proprietà collega un saggio stratigrafico all'ambiente in un il saggio è stato effettuato.
comment: This property relates a stratigraphic record to the area in which it took place. @en
domain: CulturalEntity
range: Location
sub property of: hasLocation
inverse of: è ambiente di
version info: stabile
version info: stable @en
iccd norm tag: ICCD Normativa SAS: OG/OGT/OGTX

ha settore
type: ObjectProperty
label: has stratigraphic room @en
comment: Questa proprietà collega un saggio stratigrafico al settore in cui il saggio è stato effettuato.
comment: This property relates a stratigraphic record to the room in which it took place. @en
domain: CulturalEntity
range: Location
sub property of: hasLocation
inverse of: è settore di
version info: stabile
version info: stable @en
iccd norm tag: ICCD Normativa SAS: OG/OGT/OGTY

ha quadrato
type: ObjectProperty
label: has stratigraphic square @en
comment: Questa proprietà collega un saggio stratigrafico al quadrato in un il saggio è stato effettuato.
comment: This property relates a stratigraphic record to the square in which it took place. @en
domain: CulturalEntity
range: Location
sub property of: hasLocation
inverse of: è quadrato di
version info: stabile
version info: stable @en
iccd norm tag: ICCD Normativa SAS: OG/OGT/OGTZ

ha area di appartenenza territoriale
type: ObjectProperty
label: has territorial area @en
comment: Questa proprietà collega un indirizzo a un'area di appartenenza territoriale, che può non coincidere con l'area amministrativa.
comment: This property links an address to a territorial area, which may not coincide with the administrative area, to which a cultural property belongs. @en
domain: Address
range: AdministrativeUnitComponent
sub property of: hasAddressComponent
inverse of: è area di appartenenza territoriale di
version info: stabile
version info: stable @en
iccd norm tag: ICCD Normativa Trasversale 4.00: LS/LCS/LCSR

ha ripartizione territoriale
type: ObjectProperty
label: has territorial division @en
comment: Questa proprietà collega un indirizzo a una ripartizione territoriale interna a un'area territoriale.
comment: This property links an address to a territorial division within a territorial area. @en
domain: Address
range: AdministrativeUnitComponent
sub property of: hasAddressComponent
inverse of: è ripartizione territoriale di
version info: stabile
version info: stable @en
iccd norm tag: ICCD Normativa Trasversale 4.00: LS/LCS/LCST

ha toponimo nel tempo
type: ObjectProperty
label: has toponym in time @en
comment: Questa proprietà permette di collegare un luogo a una denominazione che cambia nel tempo.
comment: This property relates a geographical entity to a toponym chianging over time. @en
domain: Feature
range: Toponimo nel tempo
inverse of: è toponimo nel tempo di
version info: stabile
version info: stable @en
iccd norm tag: ICCD Normativa Trasversale: LC/PVL/PVLT; LA/PRL/PRLT. - Versioni precedenti: LC/PVL, LA/PRL

dettagli della localizzazione
type: DatatypeProperty
label: location details @en
comment: Questa proprietà è utilizzata per rappresentare informazioni sui percorsi che permettono l’accesso al bene o che lo delimitano, o ulteriori specifiche per la localizzazione del bene.
comment: This property is used to represent other paths and details about the cultural property location. @en
domain: Localizzazione tipizzata nel tempo
range: Literal
version info: stabile
version info: stable @en
iccd norm tag: ICCD Normativa Trasversale: LC/PVC/PVCV

altitudine massima
type: DatatypeProperty
label: maximum altitude @en
comment: Questa proprietà rappresenta l'altitudine massima assoluta rispetto al livello del mare.
comment: This property represents the absolute maximum altitude above sea level. @en
domain: Altitudine
range: decimal
sub property of: altitudine
version info: stabile
version info: stable @en
iccd norm tag: ICCD Normativa Trasversale 4.00: MT/MTA/MTAX - Normative precedenti: GP/GPC/GPCS; GA/GAQS; GL/GLQ/GLQS

altitudine minima
type: DatatypeProperty
label: minimum altitude @en
comment: Questa proprietà rappresenta l'altitudine minima assoluta rispetto al livello del mare.
comment: This property represents the absolute minimum altitude above sea level. @en
domain: Altitudine
range: decimal
sub property of: altitudine
version info: stabile
version info: stable @en
iccd norm tag: ICCD Normativa Trasversale 4.00: MT/MTA/MTAM; versioni precedenti: GP/GPC/GPCI -GA/GAQ/GAQI - GL/GLQ/GLQI

tipo di punto
type: DatatypeProperty
label: point type @en
comment: Questa proprietà rappresenta il tipo di punto che georeferenzia il bene catalogato. La definizione del tipo di punto non è univoca e dipende dalla tipologia e dalla conformazione del bene e dal tipo di localizzazione.
comment: This property represents the type of point that georeferences the catalogued cultural property. The definition of the point type is not univocal and depends on the cultural property's type and conformation as well as on the type of location. @en
domain: Geometry
range: Literal
version info: stabile
version info: stable @en
iccd norm tag: Normative precedenti alla 4.00: GP/GPC/GPCT

altitudine relativa
type: DatatypeProperty
label: relative altitude @en
comment: Questa proprietà rappresenta l'altezza relativa dell'oggetto rispetto a un punto, un elemento o una situazione da specificare.
comment: This property represents the object relative height by reference to a point or an element or a situation to be specified. @en
domain: Altitudine
range: decimal
sub property of: altitudine
version info: stabile
version info: stable @en
iccd norm tag: ICCD Normativa Trasversale 4.00: MT/MTA/MTAR

identificativo del contenitore fisico
type: DatatypeProperty
type: FunctionalProperty
label: site identifier @en
comment: Questa proprietà permette di associare un contenitore fisico al codice assegnatogli dall'ICCD.
comment: This property allows to associate a physical container to its code assigned by the ICCD. @en
domain: Site
range: Literal
sub property of: identifier
version info: stabile
version info: stable @en
iccd norm tag: ICCD Normativa Trasversale: LC/LDC/LDCK; LA/PRC/PRCK

sistema di riferimento
type: DatatypeProperty
label: spatial reference system @en
comment: Questa proprietà rappresenta il sistema di riferimento utilizzato per la georeferenziazione (ad es. WGS84, WGS84 UTM32, ecc.).
comment: This property represents the reference system used for the object georeferencing (e.g. WGS84, WGS84 UTM32, etc.). @en
domain: Geometry
range: Literal
version info: stabile
version info: stable @en
iccd norm tag: ICCD Normativa Trasversale 4.00: GE/GEP - Normative precedenti: GA/GAP; GL/GLP; GP/GPP

sono coordinate di
type: ObjectProperty
label: are coordinates of @en
comment: Questa è la proprietà inversa di "ha coordinate".
comment: This is the inverse property of "has coordinates". @en
domain: Coordinate
range: Geometry
inverse of: ha coordinate
version info: stabile
version info: stable @en

ha altitudine
type: ObjectProperty
label: has altitude @en
comment: Questa proprietà collega le coordinate relative alla georeferenziazione di un oggetto (Geometry) alla sua altitudine.
comment: This property links the georeferencing coordinates of an object (Geometry) to its altitude. @en
domain: Coordinate
range: Altitudine
inverse of: è altitudine di
version info: stabile
version info: stable @en
iccd norm tag: quota minima: GP/GPC/GPCI - GA/GAQ/GAQI - GL/GLQ/GLQI - MT/MTA/MTAM; quota massima: GP/GPC/GPCS - GA/GAQS - GL/GLQ/GLQS - MT/MTA/MTAX; quota relativa: MT/MTA/MTAR; coordinata z: 4.00 GE/GEC/GECZ - 3.00GP/GPC/GPCL

ha città catastale
type: ObjectProperty
label: has cadastral city @en
comment: Questa proprietà collega un'identità catastale di un'entità al comune a cui è intestato il foglio di mappa catastale, riportato nella forma attestata nel catasto.
comment: This property links a cadastral identity of an entity to the municipality to which the cadastral map is registered, as attested by the cadastre. @en
domain: Identità catastale
range: City
sub property of: ha entità catastale
inverse of: è città catastale di
version info: stabile
version info: stable @en
iccd norm tag: ICCD Normativa Trasversale 4.00: CS/CTS/CTSC. - Normativa RA v.2: RP/LGC/LGCC

ha tipo di catasto
type: ObjectProperty
type: FunctionalProperty
label: has cadastre type @en
comment: Questa proprietà collega una identità catastale relativa a un'entità al tipo di catasto (ad es. catasto terreni, catasto fabbricati, catasto misto).
comment: This property relates a cadastral identity of an entity to the type of cadastre (e.g. land cadastre, building cadastre, mixed cadastre). @en
domain: Identità catastale
range: Tipo di catasto
sub property of: hasType
inverse of: è tipo di catasto di
version info: stabile
version info: stable @en
iccd norm tag: CS/CTS/CTST

ha coordinate
type: ObjectProperty
label: has coordinates @en
comment: Questa proprietà collega la georeferenziazione di un oggetto (Geometry) alle coordinate (x, y, z).
comment: This property links the object georeferencing (Geometry) to its coordinates (x, y, z). @en
domain: Geometry
range: Coordinate
version info: stabile
version info: stable @en
iccd norm tag: ICCD Normativa Trasversale: GE/GEC - versioni precedenti: GP/GPD; GA/GAPD; GL/GLS

Tipo amministrativo del centro storico
type: ObjectProperty
label: Old town administrative type @en
comment: Questa proprietà collega un centro storico con le informazioni relative al tipo del suo carattere amministrativo.
comment: This property connects a historical center with information related to its administrative type. @en
domain: Centro storico
range: Tipo di carattere amministrativo del centro storico
sub property of: hasType
inverse of: è tipo amministrativo del centro storico
version info: stabile
version info: stable @en
iccd norm tag: ICCD Normative A e PG: LC/CST/CSTA

ha definizione del contenitore fisico
type: ObjectProperty
label: has site definition @en
comment: Questa proprietà collega la tipologia di un contenitore fisico a una delle sue componenti, cioè alla definizione della sua tipologia.
comment: This property links the type of a physical container to one of its components, that is to the definition of its type. @en
domain: Tipo di Contenitore Fisico
range: Definizione di Contenitore Fisico
inverse of: è definizione del contenitore fisico di
version info: stabile
version info: stable @en
iccd norm tag: ICCD Normativa Trasversale: LC/LDC/LDCT

ha qualificazione del contenitore fisico
type: ObjectProperty
label: has site specification @en
comment: Questa proprietà collega la tipologia di un contenitore fisico a una delle sue componenti, cioè alle specifiche sulla sua tipologia.
comment: This property links the type of a physical container to one of its components, that is to the specifications of its type. @en
domain: Tipo di Contenitore Fisico
range: Qualificazione del Contenitore Fisico
inverse of: è specificazione di contenitore fisico
version info: stabile
version info: stable @en
iccd norm tag: ICCD Normativa Trasversale: LC/LDC/LDCQ

ha tipo di contesto geografico
type: ObjectProperty
label: has type of geographical context @en
comment: Questa proprietà permette di collegare un'entità al tipo di contesto (urbano, suburbano, extraurbano, territoriale, subacqueo) in cui si trova.
comment: This property relates an entity to the type of context where the cultural property is located (i.e. urban context, suburban context, extra-urban context, territorial context, underwater context). @en
domain: Thing
range: Tipo di contesto geografico
sub property of: hasConcept
inverse of: è tipo di contesto geografico di
version info: stabile
version info: stable @en
iccd norm tag: ICCD Normativa Trasversale: LC/PVZ; LA/PRZ

ha zona urbana
type: ObjectProperty
label: has urban area @en
comment: Questa proprietà collega il centro storico con la zona urbana che ne fa parte.
comment: This property connects the old town with the urban area that is part of it. @en
domain: Centro storico
range: Zona urbana
sub property of: hasPart
deprecated: true
inverse of: è area urbana di
version info: stabile
version info: stable @en
iccd norm tag: ICCD Normative A e PG: LC/ZUR/ZURD.

è città catastale di
type: ObjectProperty
label: is cadastral city of @en
comment: Questa proprietà collega il comune a cui è intestato il foglio di mappa catastale, riportato nella forma attestata nel catasto all'identità catastale di un'entità.
comment: This property links the municipality to which the cadastral map is registered, as attested by the cadastre, to a cadastral identity of an entity. @en
domain: City
range: Identità catastale
sub property of: è entità catastale di
version info: stabile
version info: stable @en

è definizione del contenitore giuridico di
type: ObjectProperty
label: is cultural institute or site definition of @en
comment: Questa proprietà collega la definizione del contenitore giuridico alla sua tipologia.
comment: This property links the definition of a cultural institute or site to its type. @en
domain: Definizione di Contenitore Giuridico
range: Tipo di Contenitore Giuridico
version info: instabile
version info: unstable @en

è luogo o istituto della cultura di
type: ObjectProperty
label: is cultural institute or site of @en
comment: Questa proprietà collega un luogo o istituto della cultura (contenitore giuridico) al bene culturale
comment: This property links a cultural institute or site to a cultural property @en
domain: CulturalInstituteOrSite
range: Thing
version info: instabile
version info: unstable @en

è specificazione di contenitore giuridico
type: ObjectProperty
label: is cultural institute or site specification of @en
comment: Questa proprietà collega le specifiche sulla qualificazione del contenitore giuridico alla sua tipologia.
comment: This property links the specification of a cultural institute or site to one of its type. @en
domain: Specificazione di Contenitore Giuridico
range: Tipo di Contenitore Giuridico
version info: instabile
version info: unstable @en

è tipo di contenitore giuridico di
type: ObjectProperty
label: is cultural institute or site type of @en
comment: Questa proprietà collega il tipo di contenitore giuridico a un contenitore giuridico, per permetterne la corretta e precisa individuazione.
comment: This property connects the type of cultural institute or site to a cultural institute or site, to allow its correct and precise identification. @en
domain: Tipo di Contenitore Giuridico
range: CulturalInstituteOrSite
sub property of: isTypeOf
version info: instabile
version info: unstable @en

è indirizzo del bene culturale
type: ObjectProperty
label: is cultural property address of @en
comment: Questa proprietà rappresenta la relazione che collega l'indirizzo della localizzazione fisica attuale, al momento della catalogazione, con il bene culturale catalogato.
comment: This property represents the relationship that links the address of the current physical location at the cataloging time to the catalogued cultural property. @en
domain: Address
range: CulturalEntity
version info: stabile
version info: stable @en

è area storica di
type: ObjectProperty
label: is historical area of @en
comment: Questa proprietà collega un'area storico-geografica al suo indirizzo.
comment: This property links a historical-geographical area to its address. @en
domain: AdministrativeUnitComponent
range: Address
sub property of: isAddressComponentOf
version info: stabile
version info: stable @en

è contenitore fisico in
type: ObjectProperty
label: is site in @en
comment: Questa proprietà collega un contenitore fisico a una localizzazione tipizzata nel tempo.
comment: This property relates a cultural site to the time indexed typed location. @en
domain: Site
range: Localizzazione tipizzata nel tempo
sub property of: è luogo in
version info: stabile
version info: stable @en

è ambiente di
type: ObjectProperty
label: is stratigraphic area of @en
comment: Questa è la proprietà inversa di "ha ambiente".
comment: This is the inverse property of "has stratigraphic area". @en
domain: Location
range: CulturalEntity
sub property of: isLocationOf
version info: stabile
version info: stable @en

è settore di
type: ObjectProperty
label: is stratigraphic room of @en
comment: Questa è la proprietà inversa di "ha settore".
comment: This is the inverse property of "has stratigraphic room". @en
domain: Location
range: CulturalEntity
sub property of: isLocationOf
version info: stabile
version info: stable @en

è quadrato di
type: ObjectProperty
label: is stratigraphic square of @en
comment: Questa è la proprietà inversa di "ha quadrato".
comment: This is the inverse property of "has stratigraphic square". @en
domain: Location
range: CulturalEntity
sub property of: isLocationOf
version info: stabile
version info: stable @en

è area di appartenenza territoriale di
type: ObjectProperty
label: is territorial area of @en
comment: Questa proprietà collega un'area di appartenenza territoriale, che può non coincidere con l'area amministrativa, al suo indirizzo.
comment: This property links a territorial area (which may not coincide with the administrative area) to which a cultural property belongs to its address. @en
domain: AdministrativeUnitComponent
range: Address
sub property of: isAddressComponentOf
version info: stabile
version info: stable @en

è ripartizione territoriale di
type: ObjectProperty
label: is territorial division of @en
comment: Questa proprietà collega una ripartizione territoriale interna a un'area territoriale a un indirizzo.
comment: This property links a territorial division within a territorial area to an address. @en
domain: AdministrativeUnitComponent
range: Address
sub property of: isAddressComponentOf
version info: stabile
version info: stable @en

è area urbana di
type: ObjectProperty
label: is urban area of @en
comment: Questa proprietà collega la zona urbana con il suo centro storico.
comment: This property connects the the urban area with the its old town. @en
domain: Zona urbana
range: Centro storico
sub property of: isPartOf
deprecated: true
version info: stabile
version info: stable @en

latitudine
type: DatatypeProperty
label: latitude @en
comment: Questa proprietà rappresenta la coordinata y, ovvero la latitudine.
comment: This property represents the y coordinate, that is the latitude. @en
domain: Coordinate
range: Literal
version info: stabile
version info: stable @en
iccd norm tag: ICCD Normativa Trasversale 4.00: GE/GEC/GECY - Normative precedenti: GP/GPD/GPDP/GPDPY; GA/GAD/GADP/GADPY; GL/GLD/GLDP/GLDPY

longitudine
type: DatatypeProperty
label: longitude @en
comment: Questa proprietà rappresenta la coordinata x, ovvero la longitudine.
comment: This property represents the x coordinate, that is the longitude. @en
domain: Coordinate
range: Literal
version info: stabile
version info: stable @en
iccd norm tag: ICCD Normativa Trasversale 4.00: GE/GEC/GECX - Normative precedenti: GP/GPD/GPDP/GPDPX; GA/GAD/GADP/GADPX; GL/GLD/GLDP/GLDPX

Base cartografica
type: Class
label: Base map @en
comment: Questa classe rappresenta la base cartografica eventualmente utilizzata nelle attività di georeferenziazione.
comment: This class represents the base map possibly used for georeferencing activities. @en
subclass of: Object
subclass of: Restriction
  on property: è base cartografica di
  some values from: Geometry
subclass of: Restriction
  all values from: dateTime
  on property: date
version info: stabile
version info: stable @en
iccd norm tag: ICCD Normativa Trasversale 4.00: GE/GPB; versioni precedenti: GP/GPB - GA/GAB - GL/GLB

Continente
type: Class
label: Continent @en
comment: Questa classe rappresenta un Continente.
comment: This class represents a Continent. @en
subclass of: AdministrativeUnitComponent
subclass of: Restriction
  on property: è continente di
  some values from: Thing
version info: stabile
version info: stable @en

Definizione di Contenitore Giuridico
type: Class
label: Cultural Institute or Site Definition @en
comment: Questa classe rappresenta la definizione della tipologia di un contenitore giuridico.
comment: This class represents the type definition of a cultural insititute or site. @en
subclass of: Description
version info: instabile
version info: unstable @en
iccd norm tag: ICCD Normativa CG: CG/CGT

Specificazione di Contenitore Giuridico
type: Class
label: Cultural Institute or Site Specification @en
comment: Questa classe rappresenta la specificazione della tipologia di un contenitore giuridico.
comment: This class represents the type specification of a cultural insititute or site. @en
subclass of: Description
version info: instabile
version info: unstable @en
iccd norm tag: ICCD Normativa CG: CG/CGQ

Metodo di posizionamento
type: Class
label: Geometry method @en
comment: Questa classe rappresenta il metodo utilizzato per il posizionamento (esatto, approssimato, con rappresentazione simbolica).
comment: This class represents the method used for the object positioning (i.e. exact, approximate, with a symbolic representation). @en
subclass of: Method
subclass of: Restriction
  on property: è metodo di georeferenziazione di
  some values from: Geometry
disjoint with: Tecnica di georeferenziazione
version info: stabile
version info: stable @en
iccd norm tag: ICCD Normativa trasversale 4.00: GE/GPM - Normative precedenti: GP/GPM; GA/GAM; GL/GLM

Toponimo nel tempo
type: Class
label: Toponym in time @en
comment: Questa classe rappresenta eventuali altre denominazioni del luogo, che cambiano nel tempo.
comment: This class represents other place's designations changing over time. @en
subclass of: TimeIndexedSituation
subclass of: Restriction
  on property: è toponimo nel tempo di
  some values from: Feature
subclass of: Restriction
  all values from: TimeInterval
  on property: atTime
subclass of: Restriction
  on property: name
  some values from: Literal
version info: stabile
version info: stable @en
iccd norm tag: ICCD Normativa Trasversale: LC/PVL/PVLT; LA/PRL/PRLT. - Versioni precedenti: LC/PVL, LA/PRL

presso contenitore fisico
type: ObjectProperty
label: at site @en
comment: Questa proprietà collega una localizzazione tipizzata nel tempo al contenitore fisico cui si riferisce.
comment: This property links a typified location over time to its physical container (Site). @en
domain: Localizzazione tipizzata nel tempo
range: Site
sub property of: presso luogo
inverse of: è contenitore fisico in
version info: stabile
version info: stable @en
iccd norm tag: ICCD Normativa Trasversale: LC/LDC; LA/PRC

ha entità catastale
type: ObjectProperty
label: has cadastral entity @en
comment: Questa proprietà collega un'identità catastale di un'entità a una delle entità catastali, intese come oggetti spaziali, che la definiscono.
comment: This property links a cadastral identity of an entity to one of the cadastral entities, understood as spatial objects, that define it. @en
domain: Identità catastale
range: Entità catastale
inverse of: è entità catastale di
version info: stabile
version info: stable @en
iccd norm tag: ICCD Normativa Traversale 4.00: CS/CTS, CS/CTS/CTSF, CTSN; LS/CSS. LG/LGC

ha tipo di localizzazione cui si riferisce
type: ObjectProperty
label: has referred location type @en
comment: Questa proprietà collega un'entità, per esempio un situazione in cui un luogo riveste un certo ruolo nei confronti di un bene culturale in un intervallo di tempo, o una georeferenziazione, o un'identità catastale al ruolo della localizzazione (fisica attuale, precedente, di rinvenimento, ecc.) cui si riferisce.
comment: This property links an entity (e.g. a situation in which a place plays a certain role in relation to a cultural property in a time frame, or a georeferencing, or a cadastral identity) to the role of the localization referring to it (i.e current physical location, previous location, finding location, etc.). @en
domain: Thing
range: Tipo di localizzazione
sub property of: hasType
inverse of: è tipo di localizzazione cui si riferisce
version info: stabile
version info: stable @en
iccd norm tag: ICCD Normativa Trasversale 4.00: GE/GEL; LA/TLC; LA/TCL; LC (CurrentPhysicalLocation) - Normativa F: anche LR (ShotLocation) - Normative di versioni precedenti: GP/GPL; GA/GAL; GL/GLL. - CS/CTL

ha localizzazione tipizzata nel tempo
type: ObjectProperty
label: has time indexed typed location @en
comment: Questa proprietà collega un'entità a una sua localizzazione tipizzata nel tempo.
comment: This property links an entity to its typified location over time. @en
domain: Thing
range: Localizzazione tipizzata nel tempo
inverse of: è localizzazione tipizzata nel tempo
version info: stabile
version info: stable @en
iccd norm tag: ICCD Normativa Trasversale: LC; LA; per normativa F: anche LR

è altitudine di
type: ObjectProperty
label: is altitude of @en
comment: Questa proprietà collega le coordinate relative alla georeferenziazione dell'altitudine a un oggetto (Geometry).
comment: This property links the georeferencing coordinates of the altitude to an object (Geometry). @en
domain: Altitudine
range: Coordinate
version info: stabile
version info: stable @en

è base cartografica di
type: ObjectProperty
label: is base map of @en
comment: Questa proprietà collega una base cartografica alla georeferenziazione di un oggetto.
comment: This property links a base map to an object georeferencing. @en
domain: Base cartografica
range: Geometry
version info: stabile
version info: stable @en

è identitià catastale di
type: ObjectProperty
label: is cadastral identity of @en
comment: Questa proprietà collega l'insieme delle informazioni catastali, relative a una delle sue localizzazioni (storica, attuale, di rinvenimento, ecc.), a un bene culturale.
comment: This property links all the cadastral information related to one of its locations: i.e. historical location, current location, finding location, etc., to a cultural property. @en
domain: Identità catastale
range: CulturalEntity
version info: stabile
version info: stable @en

è tipo di catasto di
type: ObjectProperty
label: is cadastre type of @en
comment: Questa proprietà collega un tipo di catasto (ad es. catasto terreni, catasto fabbricati, catasto misto) a una identità catastale relativa a un'entità.
comment: This property relates the type of cadastre (e.g. land cadastre, building cadastre, mixed cadastre) to a cadastral identity of an entity. @en
domain: Tipo di catasto
range: Identità catastale
sub property of: isTypeOf
version info: stabile
version info: stable @en

è area amministrativa ecclesiastica di
type: ObjectProperty
label: is clerical administrative area of @en
comment: Questa proprietà collega un'area amministrativa ecclesiastica (ad es. una diocesi) al suo indirizzo.
comment: This property relates a clerical administrative area (e.g. a diocese) to its address. @en
domain: ClericalAdministrativeArea
range: Address
sub property of: isAddressComponentOf
version info: stabile
version info: stable @en

è continente di
type: ObjectProperty
label: is continent of @en
comment: Questa proprietà collega un continente alla localizzazione di un'entità.
comment: This property links the continent to the location of an entity. @en
domain: Continente
range: Thing
version info: stabile
version info: stable @en

è metodo di georeferenziazione di
type: ObjectProperty
label: is geometry method of @en
comment: Questa proprietà collega il metodo utilizzato per il posizionamento alla georeferenziazione.
comment: This property links the method used for the object positioning to the georeferencing. @en
domain: Metodo di posizionamento
range: Geometry
version info: stabile
version info: stable @en

è tecnica di georeferenziazione di
type: ObjectProperty
label: is geometry technique of @en
comment: Questa proprietà collega la tecnica di georeferenziazione alla georeferenziazione.
comment: This property links the georeferencing technique to the georeferencing. @en
domain: Tecnica di georeferenziazione
range: Geometry
version info: stabile
version info: stable @en

è area di appartenenza amministrativa di
type: ObjectProperty
label: is governmental administrative area of @en
comment: Questa proprietà collega un'area di appartenenza amministrativa al suo indirizzo.
comment: This property links a governmental administrative area to its address. @en
domain: GovernamentalAdministrativeArea
range: Address
sub property of: isAddressComponentOf
version info: stabile
version info: stable @en

è luogo in
type: ObjectProperty
label: is location in @en
comment: Questa proprietà collega un luogo fisico a una localizzazione tipizzata nel tempo che si riferisce a quel luogo.
comment: This property relates a geographical feature to a time indexed typed location that refers to that feature. @en
domain: Feature
range: Localizzazione tipizzata nel tempo
version info: stabile
version info: stable @en

è tipo di localizzazione cui si riferisce
type: ObjectProperty
label: is referred location type of @en
comment: Questa proprietà collega il ruolo della localizzazione (fisica attuale, precedente, di rinvenimento, ecc.) all'entità cui si riferisce, per esempio un situazione in cui un luogo riveste un certo ruolo nei confronti di un bene culturale in un intervallo di tempo, o una georeferenziazione, o un'identità catastale.
comment: This property links the role of a localization (i.e current physical location, previous location, finding location, etc.) to an entity referring to it (e.g. a situation in which a place plays a certain role in relation to a cultural property in a time frame, or a georeferencing, or a cadastral identity). @en
domain: Tipo di localizzazione
range: Thing
sub property of: isTypeOf
version info: stabile
version info: stable @en

è tipo amministrativo del centro storico
type: ObjectProperty
label: is old town administrative type of @en
comment: Questa proprietà collega il tipo di carattere amministrativo alle informazioni relative al suo centro storico.
comment: This property connects the administrative type with the information related to its historical center. @en
domain: Tipo di carattere amministrativo del centro storico
range: Centro storico
sub property of: isTypeOf
version info: stabile
version info: stable @en

è definizione del contenitore fisico di
type: ObjectProperty
label: is site definition of @en
comment: Questa proprietà collega la definizione del contenitore fisico alla sua tipologia.
comment: This property links the definition of a physical container to of its type. @en
domain: Definizione di Contenitore Fisico
range: Tipo di Contenitore Fisico
version info: stabile
version info: stable @en

è specificazione di contenitore fisico
type: ObjectProperty
label: is site specification of @en
comment: Questa proprietà collega le specifiche sulla qualificazione del contenitore fisico alla sua tipologia.
comment: This property links the specification of a physical container to one of its type. @en
domain: Qualificazione del Contenitore Fisico
range: Tipo di Contenitore Fisico
version info: stabile
version info: stable @en

è tipo di contenitore fisico di
type: ObjectProperty
label: is site type of @en
comment: Questa proprietà collega il tipo di contenitore fisico a un contenitore fisico, per permetterne la corretta e precisa individuazione.
comment: This property connects the type of physical container to a physical container (Site), to allow its correct and precise identification. @en
domain: Tipo di Contenitore Fisico
range: Site
sub property of: isTypeOf
version info: stabile
version info: stable @en

è localizzazione tipizzata nel tempo
type: ObjectProperty
label: is time indexed typed location of @en
comment: Questa proprietà collega una localizzazione tipizzata nel tempo a un'entità.
comment: This property links a typified location over time to an entity. @en
domain: Localizzazione tipizzata nel tempo
range: Thing
version info: stabile
version info: stable @en

è toponimo nel tempo di
type: ObjectProperty
label: is toponym in time of @en
comment: Questa proprietà permette di collegare una denominazione che cambia nel tempo a un luogo.
comment: This property relates a toponym chianging over time to a geographical entity. @en
domain: Toponimo nel tempo
range: Feature
version info: stabile
version info: stable @en

è tipo di contesto geografico di
type: ObjectProperty
label: is type of geographical context of @en
comment: Questa proprietà permette di collegare tipo di contesto (urbano, suburbano, extraurbano, territoriale, subacqueo) all'entità che vi si trova.
comment: This property relates the type of context (i.e. urban context, suburban context, extra-urban context, territorial context, underwater context) an entity where it is located. @en
domain: Tipo di contesto geografico
range: Thing
sub property of: isConceptOf
version info: stabile
version info: stable @en

Tecnica di georeferenziazione
type: Class
label: Geometry technique @en
comment: Questa classe rappresenta la tecnica di georeferenziazione, utilizzata per l'acquisizione delle coordinate (rilievo da cartografia con sopralluogo, rilievo da cartografia senza sopralluogo, rilievo da foto aerea con sopralluogo, rilievo da foto aerea senza sopralluogo, rilievo da satellite, rilievo tradizionale, rilievo tramite GPS, rilievo tramite punti d'appoggio fiduciali o trigonometrici, stereofotogrammetria).
comment: This class represents the technique of georeferencing, used for the acquisition of coordinates (i.e. survey from cartography with or without inspection, survey from aerial photos with or without inspection, satellite survey, traditional survey, survey via GPS, etc.). @en
subclass of: Method
subclass of: Restriction
  on property: è tecnica di georeferenziazione di
  some values from: Geometry
version info: stabile
version info: stable @en
iccd norm tag: ICCD Normativa Trasversale 4.00: GE/GPT - Normative precedenti: GP/GPT; GA/GAT; GL/GLT

Definizione di Contenitore Fisico
type: Class
label: Site Definition @en
comment: Questa classe rappresenta la definizione della tipologia di un contenitore fisico.
comment: This class represents the type definition of a physical container. @en
subclass of: Description
subclass of: Restriction
  on property: è definizione del contenitore fisico di
  some values from: Tipo di Contenitore Fisico
version info: stabile
version info: stable @en
iccd norm tag: ICCD Normativa Trasversale: LC/LDC/LDCT

Qualificazione del Contenitore Fisico
type: Class
label: Site Specification @en
comment: Questa classe rappresenta specifiche sulla qualificazione del contenitore fisico, cioè l'aggettivo o la locuzione che, rispetto alla Site Definition, precisa, integra o caratterizza il contenitore fisico dal punto di vista della condizione giuridico-amministrativa o funzionale.
comment: This class represents specifications about the physical container, i.e. the adjective or the phrase that with respect to the Site Definition specifies, integrates or characterizes the physical container from the point of view of the legal-administrative or functional condition. @en
subclass of: Description
subclass of: Restriction
  on property: è specificazione di contenitore fisico
  some values from: Tipo di Contenitore Fisico
version info: stabile
version info: stable @en
iccd norm tag: ICCD Normativa Trasversale: LC/LDC/LDCQ

Zona urbana
type: Class
label: Urban area @en
comment: Questa classe rappresenta le informazioni relative alla denominazione della zona urbana che fa parte del centro storico dove si trova il bene culturale.
comment: This class represents the informations on the denomination of the urban area that is part of the old town where the cultural property is located. @en
subclass of: AdministrativeUnitComponent
disjoint with: District
version info: stabile
version info: stable @en
iccd norm tag: ICCD Normative A e PG: LC/ZUR/ZURD.

presso luogo
type: ObjectProperty
label: at location @en
comment: Questa proprietà collega una localizzazione tipizzata nel tempo al luogo cui si riferisce.
comment: This property links a typed location over time to its related geographical entity. @en
domain: Localizzazione tipizzata nel tempo
range: Feature
inverse of: è luogo in
version info: stabile
version info: stable @en
iccd norm tag: ICCD Normativa Trasversale: se LC senza sottoelemento LDC; se LA senza sottoelemento PRC.

è entità catastale di
type: ObjectProperty
label: is cadastral entity of @en
comment: Questa proprietà collega un'entità catastale, intesa come oggetti spaziali, a alla sua identità catastale.
comment: This property links a cadastral entity, understood as spatial object, to its cadastral identity. @en
domain: Entità catastale
range: Identità catastale
version info: stabile
version info: stable @en

altitudine
type: DatatypeProperty
label: altitude @en
comment: Questa proprietà rappresenta la coordinata z di un oggetto, che ne definisce l'altitudine rispetto al livello del mare.
comment: This property represents the z coordinate of an object, which defines its altitude above sea level. @en
domain: Altitudine
range: decimal
version info: stabile
version info: stable @en
iccd norm tag: ICCD Normativa Trasversale 4.00: GE/GEC/GECZ - Normative precedenti: GP/GPC/GPCL

Centro storico
type: Class
label: Old town @en
comment: Questa classe rappresenta le informazioni che descrivono il centro storico in cui si trova il bene culturale.
comment: This class represents the information describing the old town where the cultural property is located. @en
subclass of: City
subclass of: Restriction
  all values from: Tipo di carattere amministrativo del centro storico
  on property: Tipo amministrativo del centro storico
subclass of: Restriction
  all values from: Zona urbana
  on property: ha zona urbana
version info: stabile
version info: stable @en
iccd norm tag: ICCD normative A e PG: LC/CST

Entità catastale
type: Class
label: Cadastral Entity @en
comment: Questa classe rappresenta un'entità catastale, intesa come un oggetto che può avere una rappresentazione spaziale, relativamente alla ripartizione catastale.
comment: This class represents a cadastral entity, which is intended as an object that can have a spatial representation related to the cadastral allocation. @en
subclass of: SpatialObject
subclass of: Restriction
  all values from: Identità catastale
  on property: è entità catastale di
version info: stabile
version info: stable @en
iccd norm tag: ICCD Normativa Traversale 4.00: CS/CTS; LS/CSS

Tipo di catasto
type: Class
label: Cadastre type @en
comment: Questa classe rappresenta il tipo di catasto (ad es. catasto terreni, catasto fabbricati, catasto misto).
comment: This class represents the type of cadastre (e.g. land cadastre, building cadastre, mixed cadastre). @en
subclass of: Type
subclass of: Restriction
  on property: è tipo di catasto di
  some values from: Identità catastale
version info: stabile
version info: stable @en
iccd norm tag: ICCD Normativa Trasversale 4.00: CS/CTS/CTST

Tipo di Contenitore Giuridico
type: Class
label: Cultural Institute or Site type @en
comment: Questa classe rappresenta la tipologia di un contenitore giuridico.
comment: This class represents the type of a cultural insititute or site. @en
subclass of: Type
version info: instabile
version info: unstable @en
iccd norm tag: ICCD Normativa CG: CG/CGT, CG/CGQ

Altitudine
type: Class
label: Altitude @en
comment: Questa classe rappresenta l'altitudine, ovvero l'altezza di un oggetto rispetto al livello del mare, che può essere specificata da un'altitudine massima, minima, relativa.
comment: This class represents the altitude, that is the height of an object above the sea level, which can be specified as maximum, minimum and relative altitude. @en
subclass of: Characteristic
subclass of: Restriction
  on property: è altitudine di
  some values from: Coordinate
subclass of: Restriction
  on property: altitudine
  some values from: decimal
version info: stabile
version info: stable @en
iccd norm tag: quota minima: GP/GPC/GPCI -GA/GAQ/GAQI - GL/GLQ/GLQI - MT/MTA/MTAM; quota massima: GP/GPC/GPCS - GA/GAQS - GL/GLQ/GLQS - MT/MTA/MTAX; quota relativa: MT/MTA/MTAR; coordinata z: 4.00 GE/GEC/GECZ - 3.00GP/GPC/GPCL

Coordinate
type: Class
label: Coordinates @en
comment: Questa classe rappresenta l'insieme delle coordinate, geografiche o proiettate, che permettono la georeferenziazione di un oggetto. Per la georeferenziazione puntuale sarà presente soltanto una coppia di coordinate; per la georeferenziazione lineare e areale saranno presenti più coppie di coordinate che individuano i punti che definiscono la linea o l'area che rappresenta il bene.
comment: This class represents the set of coordinates, geographic or projected, which allows the georeferencing of an object. For the punctual georeferencing there is only a pair of coordinates. For the linear and areal georeferencing there are more pairs of coordinates identifying those points of the line or area representing the object. @en
subclass of: Geometry
subclass of: Collection
subclass of: Restriction
  on property: sono coordinate di
  some values from: Geometry
subclass of: Restriction
  all values from: Altitudine
  on property: ha altitudine
subclass of: Restriction
  all values from: Literal
  on property: latitudine
subclass of: Restriction
  all values from: Literal
  on property: longitudine
version info: stabile
version info: stable @en
iccd norm tag: ICCD Normativa Trasversale: GE/GEC - Normative precedenti: GP/GPD; GA/GAPD; GL/GLS

Tipo di carattere amministrativo del centro storico
type: Class
label: Old town administrative type @en
comment: Questa classe rappresenta le informazioni che precisano il carattere amministrativo del centro storico, che può essere: un capoluogo, una frazione, un centro inglobato o una località.
comment: This class represents the information clarifying the administrative character of the old town, which may be: a chief town, a town fraction, an incorporated area or a locality. @en
subclass of: Type
subclass of: Restriction
  on property: è tipo amministrativo del centro storico
  some values from: Centro storico
version info: stabile
version info: stable @en
iccd norm tag: ICCD Normative A e PG: LC/CST/CSTA

Localizzazione tipizzata nel tempo
type: Class
label: Time Indexed Typed Location @en
description: An example of usage of the class 'Time Indexed Typed Location' is the following: resource:TimeIndexedTypedLocation/0800055566-alternative-1 a a-loc:TimeIndexedTypedLocation ; rdfs:label "Alternative location 1 of cultural property: 0800055566"@en ; a-loc:atSite resource:Site/7761991208459c29ef5c7cee8ff29deb ; a-loc:hasLocationType a-loc:LastLocation ; tiapit:atTime resource:TimeInterval/2002 . @en
description: Un esempio d'uso della classe "Localizzazione tipizzata nel tempo' è il seguente: resource:TimeIndexedTypedLocation/0800055566-alternative-1 a a-loc:TimeIndexedTypedLocation ; rdfs:label "Altra localizzazione 1 del bene culturale: 0800055566"@en ; a-loc:atSite resource:Site/7761991208459c29ef5c7cee8ff29deb ; a-loc:hasLocationType a-loc:LastLocation ; tiapit:atTime resource:TimeInterval/2002 .
comment: Questa classe rappresenta una localizzazione di un bene culturale, inserita in un arco temporale e qualificata in base al ruolo che la localizzazione riveste nei confronti del bene culturale.
comment: This class represents a localization of a cultural property, within a timeframe and qualified according to the role that the localization plays in relation to the cultural property. @en
subclass of: TimeIndexedSituation
subclass of: Restriction
  on property: ha tipo di localizzazione cui si riferisce
  some values from: Tipo di localizzazione
subclass of: Restriction
  on property: è localizzazione tipizzata nel tempo
  some values from: Thing
subclass of: Restriction
  all values from: Feature
  on property: presso luogo
subclass of: Restriction
  all values from: Site
  on property: presso contenitore fisico
subclass of: Restriction
  all values from: TimeInterval
  on property: atTime
version info: stabile
version info: stable @en
iccd norm tag: ICCD Normativa Trasversale: LC; LA; per normativa F: anche LR

Tipo di Contenitore Fisico
type: Class
label: Site Type @en
comment: Questa classe rappresenta il tipo di contenitore fisico, cioè la tipologia del contenitore fisico ed eventuali aggettivi o locuzioni che precisano, integrano o caratterizzano il contenitore fisico dal punto di vista della condizione giuridico-amministrativa o funzionale.
comment: This class represents the type of a physical container, i.e. it contains adjectives or phrases that specify, integrate or characterize the physical container from the point of view of the legal-administrative or functional condition. @en
subclass of: Type
subclass of: Restriction
  on property: ha definizione del contenitore fisico
  some values from: Definizione di Contenitore Fisico
subclass of: Restriction
  on property: è tipo di contenitore fisico di
  some values from: Site
subclass of: Restriction
  all values from: Qualificazione del Contenitore Fisico
  on property: ha qualificazione del contenitore fisico
version info: stabile
version info: stable @en
iccd norm tag: ICCD Normativa Trasversale: LC/LDC/LDCT; LC/LDC/LDCQ

Tipo di contesto geografico
type: Class
label: Type of geographic context @en
comment: Questa classe rappresenta il tipo di contesto in cui si trova un bene culturale, che può essere urbano, suburbano, extraurbano, territoriale, subacqueo.
comment: This class represents the type of geographical context where the cultural property is located: i.e. urban, suburban, extra-urban, territorial, underwater. @en
subclass of: Concept
subclass of: Restriction
  on property: è tipo di contesto geografico di
  some values from: Thing
version info: stabile
version info: stable @en
iccd norm tag: ICCD Normativa Trasversale: LC/PVZ; LA/PRZ - Normative A e PG: LC/SET/SETT

Identità catastale
type: Class
label: Cadastral identity @en
description: An example of usage of the class 'Cadastral Identity' is the following: resource:CadastralIdentity/1400055239-1 a a-loc:CadastralIdentity ; rdfs:label "Cadastral identity 1 of cultural property: 1400055239"@en ; a-cd:hasLegalSituation resource:LegalSituation/1400055239-cadastral-legal-situation-1 ; a-loc:hasCadastralCity resource:City/s-martino-in-pensilis ; a-loc:hasCadastralEntity resource:CadastralUnitCollection/1400055239-207 , resource:CadastralFolio/1400055239-8 . @en
description: Un esempio d'uso della classe "Identità catastale" è il seguente: resource:CadastralIdentity/1400055239-1 a a-loc:CadastralIdentity ; rdfs:label "Identità catastale 1 del bene culturale: 1400055239"@en ; a-cd:hasLegalSituation resource:LegalSituation/1400055239-cadastral-legal-situation-1 ; a-loc:hasCadastralCity resource:City/s-martino-in-pensilis ; a-loc:hasCadastralEntity resource:CadastralUnitCollection/1400055239-207 , resource:CadastralFolio/1400055239-8 .
comment: ICCD Normativa Traversale 4.00: CS; LS
comment: Questa classe rappresenta l'identità catastale di un'entità, intesa come l'insieme delle informazioni di localizzazione che riguardano il bene con riferimento alla ripartizione catastale nazionale. L'identità catastale di un'entità può avere un riferimento cronologico, che indica l'epoca alla quale risalgono i dati catastali.
comment: This class represents the cadastral identity of an entity, which is intended as a set of location information concerning the property with reference to the national cadastral allocation. The cadastral identity can have a chronological reference indicating the dating of cadastral data. @en
subclass of: Object
subclass of: Restriction
  on property: ha città catastale
  some values from: City
subclass of: Restriction
  on property: ha entità catastale
  some values from: Entità catastale
subclass of: Restriction
  on property: ha tipo di catasto
  some values from: Tipo di catasto
subclass of: Restriction
  on property: ha tipo di localizzazione cui si riferisce
  some values from: Tipo di localizzazione
subclass of: Restriction
  on property: è identitià catastale di
  some values from: CulturalEntity
subclass of: Restriction
  all values from: Literal
  on property: time
version info: stabile
version info: stable @en
iccd norm tag: ICCD Normativa Trasversale 4.00: CS. - Normativa RA v.2: RP/LGC

Tipo di localizzazione
type: Class
label: Location Type @en
comment: Questa classe rappresenta il tipo di localizzazione di un bene culturale.
comment: This class represents the type of location of a cultural property. @en
subclass of: Type
subclass of: Restriction
  on property: è tipo di localizzazione cui si riferisce
  some values from: Thing
version info: stabile
version info: stable @en
iccd norm tag: ICCD Normativa Trasversale: LA/TLC; LA/TCL; LC (CurrentPhysicalLocation) - Normativa F: anche LR (ShotLocation). - CS/CTL. - GE/GEL; GP/GPL; GL/GLL; GA/GAL

Ontologia della Localizzazione (ArCo network)
type: Ontology
label: Location Ontology (ArCo network) @en
reuses pattern as template: timeindexedsituation.owl
reuses pattern as template: classification.owl
reuses pattern as template: collectionentity.owl
reuses pattern as template: situation.owl
reuses pattern as template: place.owl#
creator: Aldo Gangemi (ISTC-CNR, STLab)
creator: Andrea Nuzzolese (ISTC-CNR, STLab)
creator: Chiara Veninata (MiBAC, ICCD)
creator: Ludovica Marinucci (ISTC-CNR, STLab)
creator: Luigi Asprino (ISTC-CNR, STLab)
creator: Margherita Porena (ISTC-CNR, STLab)
creator: Marialetizia Mancinelli (MiBAC, ICCD)
creator: Valentina Carriero (ISTC-CNR, STLab)
creator: Valentina Presutti (ISTC-CNR, STLab)
language: ENG
language: ITA
issued: 2018-03-07
license: https://creativecommons.org/licenses/by-sa/4.0/
license: A31 CCBYSA40
modified: 2020-03-27
comment: Questo modulo modella le informazioni relative alle localizzazioni e alla georeferenziazione di un bene culturale. In questo modulo si riusano come template i seguenti Ontology Design Patterns: - http://www.ontologydesignpatterns.org/cp/owl/collectionentity.owl - http://www.ontologydesignpatterns.org/cp/owl/classification.owl - http://www.ontologydesignpatterns.org/cp/owl/place.owl - http://www.ontologydesignpatterns.org/cp/owl/timeindexedsituation.owl - http://www.ontologydesignpatterns.org/cp/owl/situation.owl
comment: The module Location models information related to the localization and georeferencing of a cultural property. In this module the following Ontology Design Patterns have been used: - http://www.ontologydesignpatterns.org/cp/owl/collectionentity.owl - http://www.ontologydesignpatterns.org/cp/owl/classification.owl - http://www.ontologydesignpatterns.org/cp/owl/place.owl - http://www.ontologydesignpatterns.org/cp/owl/timeindexedsituation.owl - http://www.ontologydesignpatterns.org/cp/owl/situation.owl @en
imports: https://w3id.org/arco/ontology/core/1.2
version IRI: https://w3id.org/arco/ontology/location/1.2
version info: Version 1.2
version info: Versione 1.2